{"text_format":"1","workbook":"xlsx","n_sheets":4,"sheets":["inputs and results","calcs - nuvos","Variable information","factors - nuvos"],"not_rendered":{"charts":0,"images":1,"macros":1,"external_links":0,"defined_names":0,"comments":2,"pivot_tables":0},"unopened":[],"bounds":{"document_bytes":16777216,"sheet_cells":100000,"rows_first":2000,"rows_last":500,"rows_between":2000,"halvings":0,"cell_chars":16384,"cell_head_chars":4096},"cells_cut":0,"cells_raw":0,"read":"whole","date_system":"1900"}

{"sheet":"inputs and results","index":0,"n_rows":43,"n_cols":13,"rows_kept":43,"cut":false,"hidden":false,"merged":[[36,2,36,11],[37,2,37,11],[39,2,39,11],[40,2,40,11],[33,2,33,11],[34,2,34,11],[35,2,35,11],[0,4,0,8],[24,2,24,11],[25,2,25,11],[26,2,26,11],[27,2,27,11],[28,2,28,11],[29,2,29,11],[30,2,30,11],[31,2,31,11],[32,2,32,11]]}
[null,null,null,null,"Added pension estimator -\nfor members of nuvos"]
[null,"Please fill in all of the blue boxes and either one or other of the orange boxes "]
[]
[null,"About you"]
[null,null,null,null,null,null,null,null,null,null,null,null,"female"]
[null,null,null,null,"What is your date of birth? ",null,null,null,null,null,null,null,"male"]
[]
[null,null,null,null,"What is your gender? "]
[null,null,{"$f":"IF(AND(G6=\"\",G12<>\"\"),\"You must enter date of birth\",\"\")","v":""},null,null,null,null,null,null,null,null,null,{"$f":"\"You cannot buy more than \"&TEXT('calcs - nuvos'!G3,\"£0,000\")&\" added pension\"","v":"You cannot buy more than £9,200 added pension"}]
[null,"About your added pension"]
[]
[null,null,null,null,"How do you want to pay for your Added Pension? ",null,null,null,null,{"$f":"IF(G12=\"lump sum\",\" \",\"for how many years?\")","v":"for how many years?"},null,null,"lump sum"]
[null,null,null,null,null,null,null,null,null,null,null,null,"monthly contributions"]
[null,null,null,null,"What sort of pension do you want to buy? ",null,null,null,{"$f":"'calcs - nuvos'!A30","v":""},null,null,null,"pension for self only"]
[null,null,null,null,null,null,null,null,null,null,null,null,"pension for self + dependants"]
[null,"Either: ",null,null,"How much do you want to save? ",null,null,null,{"$f":"IF(G12=\"lump sum\",\" \",\"per month\")","v":"per month"},{"$f":"IF(AND(G16<>\"\",G18<>\"\"),\"please enter figures into only one of the orange boxes, leave the other blank\",\"\")","v":""}]
[]
[null,"Or: ",null,null,"How much pension do you want to buy? ",null,null,null,"a year ",{"$f":"IF(G18>'calcs - nuvos'!G3,M9,\" \")","v":" "}]
[]
[null,"Your results"]
[null,null,null,null,null,null,null,null,null,null,null,null,{"$f":"IF(G16<>\"\",1,2)","v":2}]
[null,null,null,null,{"$f":"IF(M21=1,\"Your savings will buy an annual pension of: \",\"This pension will cost you: \")","v":"This pension will cost you: "},null,{"$f":"IF(G6<>\"\",'calcs - nuvos'!B28,\"\")","v":""},null,{"$f":"IF(AND('calcs - nuvos'!D2=\"periodicals\",'calcs - nuvos'!B4<>\"savings\"),\"per month\",IF('calcs - nuvos'!B4=\"savings\",\" \",\"\"))","v":"per month"},{"$f":"IF('calcs - nuvos'!B4=\"savings\",'calcs - nuvos'!A29,\"\")","v":""}]
[]
[null,"Important notes:"]
[null,1,"The added pension estimator held on the Civil Service Pension website uses the latest calculation factors. These factors, and therefore the results, may be subject to change in the future."]
[null,2,"Please note that if you do not use the most recent version of the added pension estimator then the results will not be valid. The latest estimator is held on the Civil Service Pension Scheme website: www.civilservicepensionscheme.org.uk",null,null,null,null,null,null,null,null,null,"enter a date"]
[null,3,"The cost shown is the gross amount. You will normally get income tax relief on these contributions. If you make your payment through payroll the tax relief will be applied automatically. If you make a lump sum purchase by cheque you will have to claim tax relief from HM Revenue & Customs.",null,null,null,null,null,null,null,null,null,52]
[null,4,"If you have chosen added pension for self and dependants, this will provide a dependants’ pension (paid after death to a surviving wife, husband, civil partner or partner) of 37.5% of your added pension.",null,null,null,null,null,null,null,null,null,54]
[null,5,"In most circumstances your added pension will come into payment at the same time as your nuvos pension. If you draw your pension before Normal Pension Age (NPA) it will be reduced for early payment. If you carry on working beyond your NPA, your pension will be increased for late payment.",null,null,null,null,null,null,null,null,null,56]
[null,6,"Added pension will be adjusted in line with prices.",null,null,null,null,null,null,null,null,null,59]
[null,7,"If you have selected monthly contributions, the estimator assumes that these start from the next 1 April and run for a complete number of years.",null,null,null,null,null,null,null,null,null,60]
[null,8,"The figures shown are an illustration of the current cost of buying added pension.",null,null,null,null,null,null,null,null,null,61]
[null,9,"If you have selected monthly contributions, the estimator assumes that these start from the date that your contract starts and run for a complete number of years. You can request to cancel your monthly contributions at any time, but you must continue to make your contributions until the end of the scheme year (31 March). Lump sum purchases are assumed to be made at the contract start date. You cannot buy added pension by lump sum in your first 12 months of scheme membership.",null,null,null,null,null,null,null,null,null,62]
[null,10,"If you have selected to pay contributions over a number of years, the estimator has taken account of your age increasing over the period and resulting amount of added pension that the current factors will purchase in each future year. However, you should be aware that the factors underlying these calculations are reviewed regularly and the cost of this level of pension may change in the future.",null,null,null,null,null,null,null,null,null,64]
[null,11,"Your total pension contributions (not just added pension) in any year cannot be more than your salary.",null,null,null,null,null,null,null,null,null,65]
[null,12,"If you increase your pension savings in any year over the Annual Allowance set by HM Revenue & Customs, you may incur a tax charge. For more information, including examples, see the HM Revenue & Customs website: www.hmrc.gov.uk",null,null,null,null,null,null,null,null,null,68]
[null,13,"If you want to purchase added pension, the application form is available on the Civil Service Pension Scheme website.",null,null,null,null,null,null,null,null,null,69]
[null,14,"This is a calculated value at today’s rates."]
[null,null,null,null,null,null,null,null,null,null,null,null,72]
[null,"Disclaimer:","Every effort has been made to make this tool as accurate as possible, but in the event of any differences, the regulations will apply. This tool is based on the nuvos rules current at the time of publication and there is no guarantee that any part of the rules will not change in the future. You should not take anything in this tool as financial advice. You might want to consider contacting an Independent Financial Adviser (IFA) to discuss your retirement planning. You can find tips on finding an IFA by visiting the Financial Conduct Authority website: www.fca.org.uk",null,null,null,null,null,null,null,null,null,73]
[null,null,"To share your views and feedback on this calculator, please complete this short survey."]
[null,{"$f":"\"Version 7 (Feb 2022).  Printed on \"&TEXT(TODAY(),\"dd mmmm yyyy\")","v":"Version 7 (Feb 2022).  Printed on 22 October 2024"}]
[null,{"$f":"\"'as at' date \"&TEXT('calcs - nuvos'!B86,\"dd mmmm yyyy\")","v":"'as at' date 01 April 2025"}]

{"sheet":"calcs - nuvos","index":1,"n_rows":86,"n_cols":9,"rows_kept":86,"cut":false,"hidden":true,"merged":[]}
[]
["Chosen contribution type",{"$f":"'inputs and results'!G12","v":0},{"$f":"IF(D2<>\"LS\",'inputs and results'!K12,0)","v":0},{"$f":"IF(B2=\"lump sum\",\"LS\",\"periodicals\")","v":"periodicals"},null,"AMC rate",{"$f":"'Variable information'!B3","v":0}]
["Chosen pension",{"$f":"'inputs and results'!G14","v":0},{"$f":"IF(B3=\"pension for self only\",\"self\",\"self+\")","v":"self+"},null,null,"HMT max",{"$f":"IF(D2=\"periodicals\",9200,7300)","v":9200}]
["Chosen calculation type",{"$f":"IF('inputs and results'!G16<>\"\",\"savings\",\"target pension\")","v":"target pension"}]
["Monetary amount input",{"$f":"IF(B4=\"savings\",'inputs and results'!G16,'inputs and results'!G18)","v":0}]
["pension age",65]
["DOB",{"$f":"'inputs and results'!G6","v":"00:00:00"},{"$f":"DATE(B6+YEAR(B7),MONTH(B7),DAY(B7))","v":"1964-12-31"},{"$f":"IF(MONTH(B7)<=3,0,1)","v":0}]
["Quote date",{"$f":"'Variable information'!B5","v":"2024-10-22"},{"$f":"IF(MONTH(B8)<=3,1,0)","v":0},{"$f":"DATE(YEAR(B8)+1-C8,4,1)","v":"2025-04-01"},{"$f":"IF(MONTH(D8)<=3,1,0)","v":0}]
["Age at quote date",{"$f":"ROUNDDOWN((YEAR(B8)-YEAR($B$7)+(B8-DATE(YEAR(B8),MONTH($B$7),DAY($B$7)))/365),0)","v":124},null,{"$f":"ROUNDDOWN(YEAR(D8)-YEAR($B$7)+(D8-DATE(YEAR(D8),MONTH($B$7),DAY($B$7)))/365,0)","v":125}]
["No of 1 Aprils to PA",{"$f":"MAX(0,YEAR($C$7)-YEAR(B8)+C8+D7-1)","v":0},null,{"$f":"MAX(0,YEAR($C$7)-YEAR(D8)+E8+D7-1)","v":0}]
["m/f",{"$f":"'inputs and results'!G8","v":0},{"$f":"LEFT(B11)","v":"0"},{"$f":"IF(C3=\"self+\",8,IF(C11=\"f\",5,4))","v":8},{"$f":"IF(C3=\"self+\",7,IF(C11=\"f\",3,2))","v":7}]
["Lump sum calcs",null,null,null,"AMC calc",null,null,"New Perodical Calc"]
["factor below",{"$f":"VLOOKUP(INT($B$9),'factors - nuvos'!$A$4:$H$63,$E$11)","v":13.13},null,null,"column 1",{"$f":"INT(G2)","v":0},null,"Exact Factor",{"$f":"VLOOKUP(INT($D$9),'factors - nuvos'!$A$4:$H$63,$D$11)","v":13.92}]
["factor above",{"$f":"VLOOKUP(INT($B$9)+1,'factors - nuvos'!$A$4:$H$63,$E$11)","v":13.13},null,null,"age at quote",{"$f":"B9","v":124},null,"Contribution Factor",{"$f":"VLOOKUP($D$10,'factors - nuvos'!$J$4:$K$54,2)","v":1}]
["exact factor",{"$f":"B13","v":13.13},{"$f":"ROUND(B13+(B14-B13)*(B9-INT(B9)),4)","v":13.13},null,"factor below",{"$f":"VLOOKUP(INT(F14),'factors - nuvos'!A69:E128,$F$13+2)","v":1},null,"Exact Factor x Contribution Factor",{"$f":"I13*I14","v":13.92}]
["Aprils factor",{"$f":"VLOOKUP($B$10,'factors - nuvos'!$J$4:$K$54,2)","v":1},null,null,"factor above",{"$f":"VLOOKUP(INT(F14),'factors - nuvos'!A69:E128,F13+3)","v":1},null,"Monthly Rate",{"$f":"D21/I15*C2","v":0}]
["lump sum rate before AMC",{"$f":"ROUND(B15*B16,4)","v":13.13},null,null,"exact factor",{"$f":"ROUND(F15+(F16-F15)*(G2-INT(G2)),4)","v":1}]
["AMC adjustment",{"$f":"F17","v":1}]
["lump sum rate",{"$f":"ROUND(B17*B18,4)","v":13.13}]
[null,null,null,null,null,null,null,"Max"]
["required level of contribution",{"$f":"IF(D2=\"periodicals\",'inputs and results'!G16,0)","v":0},"per month",{"$f":"B21*12","v":0},{"$f":"I16","v":0},"annual pension",null,{"$f":"G3/(12*D22)","v":{"$error":"#N/A"}},"per month"]
[null,{"$f":"C2","v":0},"years",{"$f":"VLOOKUP(B22,A34:G83,7)","v":{"$error":"#N/A"}}]
[null,{"$f":"IF(D2=\"LS\",'inputs and results'!G16,0)","v":0},"lump sum",null,{"$f":"B23/B19","v":0},"annual pension",null,{"$f":"G3*B19","v":120796},"Lump sum"]
[]
["required amount of pension 1",{"$f":"IF(D2=\"LS\",'inputs and results'!G18,0)","v":0},"pa",null,{"$f":"B25*B19","v":0},"lump sum",null,{"$f":"G3","v":9200},"pension"]
["required pension 2",{"$f":"IF(D2=\"periodicals\",'inputs and results'!G18,0)","v":0},"pa",null,{"$f":"B26/(D22*12)","v":{"$error":"#N/A"}},"per month",null,{"$f":"G3","v":9200}]
[]
["Required answer",{"$f":"IF(AND(D2=\"LS\",B4=\"savings\"),E23,IF(AND(D2=\"periodicals\",B4=\"savings\"),E21,IF(D2=\"LS\",E25,E26)))","v":{"$error":"#N/A"}},null,"Max",{"$f":"INDEX(H21:H26,MATCH(B28,E21:E26,0))","v":{"$error":"#N/A"}},{"$f":"INDEX(B21:B26,MATCH(B28,E21:E26,0))","v":{"$error":"#N/A"}}]
[{"$f":"IF(F28>E28,\"The maximum contribution you can pay is \"&TEXT(E28,\"£#,###.00\")&\"\",\"\")","v":{"$error":"#N/A"}}]
[{"$f":"IF(C2>D10,\"The calculator cannot provide a result based upon the information you have entered. Please contact MyCSP for a quotation.\",\"\")","v":""}]
[]
["Periodicals calc"]
["Year","factor below","factor above","rate","Aprils","periodicals","cum purchase"]
[1,{"$f":"VLOOKUP(INT($D$9),'factors - nuvos'!$A$4:$H$63,$D$11)","v":13.92},{"$f":"VLOOKUP(INT($D$9)+1,'factors - nuvos'!$A$4:$H$63,$D$11)","v":13.92},{"$f":"ROUND(B34+(C34-B34)*($B$9-INT($B$9)),4)","v":13.92},{"$f":"VLOOKUP($D$10,'factors - nuvos'!$J$4:$K$54,2)","v":1},{"$f":"E34*D34","v":13.92},{"$f":"1/F34","v":7.183908045977011E-2}]
[2,{"$f":"VLOOKUP(INT($D$9+A35-1),'factors - nuvos'!$A$4:$H$63,$D$11)","v":13.92},{"$f":"VLOOKUP(INT($D$9)+A35,'factors - nuvos'!$A$4:$H$63,$D$11)","v":13.92},{"$f":"ROUND(B35+(C35-B35)*($B$9-INT($B$9)),4)","v":13.92},{"$f":"VLOOKUP(MAX(1,$D$10+1-A35),'factors - nuvos'!$J$4:$K$54,2)","v":1.02},{"$f":"E35*D35","v":14.198399999999999},{"$f":"G34+1/F35","v":0.14226955149876042}]
[3,{"$f":"VLOOKUP(INT($D$9+A36-1),'factors - nuvos'!$A$4:$H$63,$D$11)","v":13.92},{"$f":"VLOOKUP(INT($D$9)+A36,'factors - nuvos'!$A$4:$H$63,$D$11)","v":13.92},{"$f":"ROUND(B36+(C36-B36)*($B$9-INT($B$9)),4)","v":13.92},{"$f":"VLOOKUP(MAX(1,$D$10+1-A36),'factors - nuvos'!$J$4:$K$54,2)","v":1.02},{"$f":"E36*D36","v":14.198399999999999},{"$f":"G35+1/F36","v":0.21270002253775072}]
[4,{"$f":"VLOOKUP(INT($D$9+A37-1),'factors - nuvos'!$A$4:$H$63,$D$11)","v":13.92},{"$f":"VLOOKUP(INT($D$9)+A37,'factors - nuvos'!$A$4:$H$63,$D$11)","v":13.92},13.92,{"$f":"VLOOKUP(MAX(1,$D$10+1-A37),'factors - nuvos'!$J$4:$K$54,2)","v":1.02},14.198399999999999,0.28313049357674103]
[5,{"$f":"VLOOKUP(INT($D$9+A38-1),'factors - nuvos'!$A$4:$H$63,$D$11)","v":13.92},{"$f":"VLOOKUP(INT($D$9)+A38,'factors - nuvos'!$A$4:$H$63,$D$11)","v":13.92},13.92,{"$f":"VLOOKUP(MAX(1,$D$10+1-A38),'factors - nuvos'!$J$4:$K$54,2)","v":1.02},14.198399999999999,0.35356096461573133]
[6,{"$f":"VLOOKUP(INT($D$9+A39-1),'factors - nuvos'!$A$4:$H$63,$D$11)","v":13.92},{"$f":"VLOOKUP(INT($D$9)+A39,'factors - nuvos'!$A$4:$H$63,$D$11)","v":13.92},13.92,{"$f":"VLOOKUP(MAX(1,$D$10+1-A39),'factors - nuvos'!$J$4:$K$54,2)","v":1.02},14.198399999999999,0.42399143565472164]
[7,{"$f":"VLOOKUP(INT($D$9+A40-1),'factors - nuvos'!$A$4:$H$63,$D$11)","v":13.92},{"$f":"VLOOKUP(INT($D$9)+A40,'factors - nuvos'!$A$4:$H$63,$D$11)","v":13.92},13.92,{"$f":"VLOOKUP(MAX(1,$D$10+1-A40),'factors - nuvos'!$J$4:$K$54,2)","v":1.02},14.198399999999999,0.49442190669371194]
[8,{"$f":"VLOOKUP(INT($D$9+A41-1),'factors - nuvos'!$A$4:$H$63,$D$11)","v":13.92},{"$f":"VLOOKUP(INT($D$9)+A41,'factors - nuvos'!$A$4:$H$63,$D$11)","v":13.92},13.92,{"$f":"VLOOKUP(MAX(1,$D$10+1-A41),'factors - nuvos'!$J$4:$K$54,2)","v":1.02},14.198399999999999,0.56485237773270225]
[9,{"$f":"VLOOKUP(INT($D$9+A42-1),'factors - nuvos'!$A$4:$H$63,$D$11)","v":13.92},{"$f":"VLOOKUP(INT($D$9)+A42,'factors - nuvos'!$A$4:$H$63,$D$11)","v":13.92},13.92,{"$f":"VLOOKUP(MAX(1,$D$10+1-A42),'factors - nuvos'!$J$4:$K$54,2)","v":1.02},14.198399999999999,0.63528284877169261]
[10,{"$f":"VLOOKUP(INT($D$9+A43-1),'factors - nuvos'!$A$4:$H$63,$D$11)","v":13.92},{"$f":"VLOOKUP(INT($D$9)+A43,'factors - nuvos'!$A$4:$H$63,$D$11)","v":13.92},13.92,{"$f":"VLOOKUP(MAX(1,$D$10+1-A43),'factors - nuvos'!$J$4:$K$54,2)","v":1.02},14.198399999999999,{"$f":"G42+1/F43","v":0.70571331981068286}]
[11,{"$f":"VLOOKUP(INT($D$9+A44-1),'factors - nuvos'!$A$4:$H$63,$D$11)","v":13.92},{"$f":"VLOOKUP(INT($D$9)+A44,'factors - nuvos'!$A$4:$H$63,$D$11)","v":13.92},13.92,{"$f":"VLOOKUP(MAX(1,$D$10+1-A44),'factors - nuvos'!$J$4:$K$54,2)","v":1.02},14.198399999999999,0.77614379084967311]
[12,{"$f":"VLOOKUP(INT($D$9+A45-1),'factors - nuvos'!$A$4:$H$63,$D$11)","v":13.92},{"$f":"VLOOKUP(INT($D$9)+A45,'factors - nuvos'!$A$4:$H$63,$D$11)","v":13.92},13.92,{"$f":"VLOOKUP(MAX(1,$D$10+1-A45),'factors - nuvos'!$J$4:$K$54,2)","v":1.02},14.198399999999999,0.84657426188866336]
[13,{"$f":"VLOOKUP(INT($D$9+A46-1),'factors - nuvos'!$A$4:$H$63,$D$11)","v":13.92},{"$f":"VLOOKUP(INT($D$9)+A46,'factors - nuvos'!$A$4:$H$63,$D$11)","v":13.92},13.92,{"$f":"VLOOKUP(MAX(1,$D$10+1-A46),'factors - nuvos'!$J$4:$K$54,2)","v":1.02},14.198399999999999,0.91700473292765361]
[14,{"$f":"VLOOKUP(INT($D$9+A47-1),'factors - nuvos'!$A$4:$H$63,$D$11)","v":13.92},{"$f":"VLOOKUP(INT($D$9)+A47,'factors - nuvos'!$A$4:$H$63,$D$11)","v":13.92},13.92,{"$f":"VLOOKUP(MAX(1,$D$10+1-A47),'factors - nuvos'!$J$4:$K$54,2)","v":1.02},14.198399999999999,0.98743520396664386]
[15,{"$f":"VLOOKUP(INT($D$9+A48-1),'factors - nuvos'!$A$4:$H$63,$D$11)","v":13.92},{"$f":"VLOOKUP(INT($D$9)+A48,'factors - nuvos'!$A$4:$H$63,$D$11)","v":13.92},13.92,{"$f":"VLOOKUP(MAX(1,$D$10+1-A48),'factors - nuvos'!$J$4:$K$54,2)","v":1.02},14.198399999999999,1.0578656750056341]
[16,{"$f":"VLOOKUP(INT($D$9+A49-1),'factors - nuvos'!$A$4:$H$63,$D$11)","v":13.92},{"$f":"VLOOKUP(INT($D$9)+A49,'factors - nuvos'!$A$4:$H$63,$D$11)","v":13.92},13.92,{"$f":"VLOOKUP(MAX(1,$D$10+1-A49),'factors - nuvos'!$J$4:$K$54,2)","v":1.02},14.198399999999999,1.1282961460446244]
[17,{"$f":"VLOOKUP(INT($D$9+A50-1),'factors - nuvos'!$A$4:$H$63,$D$11)","v":13.92},{"$f":"VLOOKUP(INT($D$9)+A50,'factors - nuvos'!$A$4:$H$63,$D$11)","v":13.92},13.92,{"$f":"VLOOKUP(MAX(1,$D$10+1-A50),'factors - nuvos'!$J$4:$K$54,2)","v":1.02},14.198399999999999,1.1987266170836146]
[18,{"$f":"VLOOKUP(INT($D$9+A51-1),'factors - nuvos'!$A$4:$H$63,$D$11)","v":13.92},{"$f":"VLOOKUP(INT($D$9)+A51,'factors - nuvos'!$A$4:$H$63,$D$11)","v":13.92},13.92,{"$f":"VLOOKUP(MAX(1,$D$10+1-A51),'factors - nuvos'!$J$4:$K$54,2)","v":1.02},14.198399999999999,1.2691570881226049]
[19,{"$f":"VLOOKUP(INT($D$9+A52-1),'factors - nuvos'!$A$4:$H$63,$D$11)","v":13.92},{"$f":"VLOOKUP(INT($D$9)+A52,'factors - nuvos'!$A$4:$H$63,$D$11)","v":13.92},13.92,{"$f":"VLOOKUP(MAX(1,$D$10+1-A52),'factors - nuvos'!$J$4:$K$54,2)","v":1.02},14.198399999999999,1.3395875591615951]
[20,{"$f":"VLOOKUP(INT($D$9+A53-1),'factors - nuvos'!$A$4:$H$63,$D$11)","v":13.92},{"$f":"VLOOKUP(INT($D$9)+A53,'factors - nuvos'!$A$4:$H$63,$D$11)","v":13.92},13.92,{"$f":"VLOOKUP(MAX(1,$D$10+1-A53),'factors - nuvos'!$J$4:$K$54,2)","v":1.02},14.198399999999999,1.4100180302005854]
[21,{"$f":"VLOOKUP(INT($D$9+A54-1),'factors - nuvos'!$A$4:$H$63,$D$11)","v":13.92},{"$f":"VLOOKUP(INT($D$9)+A54,'factors - nuvos'!$A$4:$H$63,$D$11)","v":13.92},13.92,{"$f":"VLOOKUP(MAX(1,$D$10+1-A54),'factors - nuvos'!$J$4:$K$54,2)","v":1.02},14.198399999999999,1.4804485012395756]
[22,{"$f":"VLOOKUP(INT($D$9+A55-1),'factors - nuvos'!$A$4:$H$63,$D$11)","v":13.92},{"$f":"VLOOKUP(INT($D$9)+A55,'factors - nuvos'!$A$4:$H$63,$D$11)","v":13.92},13.92,{"$f":"VLOOKUP(MAX(1,$D$10+1-A55),'factors - nuvos'!$J$4:$K$54,2)","v":1.02},14.198399999999999,1.5508789722785659]
[23,{"$f":"VLOOKUP(INT($D$9+A56-1),'factors - nuvos'!$A$4:$H$63,$D$11)","v":13.92},{"$f":"VLOOKUP(INT($D$9)+A56,'factors - nuvos'!$A$4:$H$63,$D$11)","v":13.92},13.92,{"$f":"VLOOKUP(MAX(1,$D$10+1-A56),'factors - nuvos'!$J$4:$K$54,2)","v":1.02},14.198399999999999,1.6213094433175561]
[24,{"$f":"VLOOKUP(INT($D$9+A57-1),'factors - nuvos'!$A$4:$H$63,$D$11)","v":13.92},{"$f":"VLOOKUP(INT($D$9)+A57,'factors - nuvos'!$A$4:$H$63,$D$11)","v":13.92},13.92,{"$f":"VLOOKUP(MAX(1,$D$10+1-A57),'factors - nuvos'!$J$4:$K$54,2)","v":1.02},14.198399999999999,1.6917399143565464]
[25,{"$f":"VLOOKUP(INT($D$9+A58-1),'factors - nuvos'!$A$4:$H$63,$D$11)","v":13.92},{"$f":"VLOOKUP(INT($D$9)+A58,'factors - nuvos'!$A$4:$H$63,$D$11)","v":13.92},13.92,{"$f":"VLOOKUP(MAX(1,$D$10+1-A58),'factors - nuvos'!$J$4:$K$54,2)","v":1.02},14.198399999999999,1.7621703853955366]
[26,{"$f":"VLOOKUP(INT($D$9+A59-1),'factors - nuvos'!$A$4:$H$63,$D$11)","v":13.92},{"$f":"VLOOKUP(INT($D$9)+A59,'factors - nuvos'!$A$4:$H$63,$D$11)","v":13.92},13.92,{"$f":"VLOOKUP(MAX(1,$D$10+1-A59),'factors - nuvos'!$J$4:$K$54,2)","v":1.02},14.198399999999999,1.8326008564345269]
[27,{"$f":"VLOOKUP(INT($D$9+A60-1),'factors - nuvos'!$A$4:$H$63,$D$11)","v":13.92},{"$f":"VLOOKUP(INT($D$9)+A60,'factors - nuvos'!$A$4:$H$63,$D$11)","v":13.92},13.92,{"$f":"VLOOKUP(MAX(1,$D$10+1-A60),'factors - nuvos'!$J$4:$K$54,2)","v":1.02},14.198399999999999,1.9030313274735171]
{"$rows_left_out":27}
{"sheet":"Variable information","index":2,"n_rows":7,"n_cols":6,"rows_kept":7,"cut":false,"hidden":true,"merged":[]}
["Note: Use AMC yield of 0.00 from July 2012 onwards"]
[]
["AMC yield",0,"%","2012-07-01",null,"2007-07-30"]
[]
["Quote date",{"$f":"MAX(TODAY(),$F$3)","v":"2024-10-22"},null,"dd/mm/yyyy","Note: uses the later of 30 July 2007 and today's date"]
[]
["HMT max",9000,null,"2009/10"]

{"sheet":"factors - nuvos","index":3,"n_rows":128,"n_cols":11,"rows_kept":128,"cut":false,"hidden":true,"merged":[]}
[null,"Pension for self",null,null,null,null,"Pension for self + partner"]
[null,"lump sum",null,"periodicals",null,null,"lump sum","periodicals",null,null,"Revaluation"]
["Age last birthday","Male","female","Male","female",null,"unisex","unisex",null,"no of 1 Aprils to NPA"]
[16,null,null,null,null,null,null,null,null,0,1]
[17,2.5299999999999998,2.5299999999999998,3.74,3.74,null,2.73,4.0599999999999996,null,1,1.02]
[18,2.64,2.64,3.87,3.87,null,2.85,4.21,null,2,1.04]
[19,2.75,2.75,4.01,4.01,null,2.97,4.38,null,3,1.06]
[20,2.87,2.87,4.1399999999999997,4.1399999999999997,null,3.09,4.5199999999999996,null,4,1.08]
[21,2.98,2.98,4.28,4.28,null,3.22,4.68,null,5,1.1000000000000001]
[22,3.11,3.11,4.4400000000000004,4.4400000000000004,null,3.35,4.84,null,6,1.1299999999999999]
[23,3.24,3.24,4.59,4.59,null,3.49,5.01,null,7,1.1499999999999999]
[24,3.37,3.37,4.75,4.75,null,3.64,5.18,null,8,1.17]
[25,3.52,3.52,4.92,4.92,null,3.79,5.37,null,9,1.2]
[26,3.66,3.66,5.08,5.08,null,3.95,5.55,null,10,1.22]
[27,3.82,3.82,5.26,5.26,null,4.1100000000000003,5.74,null,11,1.24]
[28,3.97,3.97,5.45,5.45,null,4.28,5.95,null,12,1.27]
[29,4.1399999999999997,4.1399999999999997,5.63,5.63,null,4.46,6.15,null,13,1.29]
[30,4.3099999999999996,4.3099999999999996,5.82,5.82,null,4.6500000000000004,6.36,null,14,1.32]
[31,4.49,4.49,6.03,6.03,null,4.84,6.58,null,15,1.35]
[32,4.68,4.68,6.23,6.23,null,5.04,6.81,null,16,1.37]
[33,4.87,4.87,6.45,6.45,null,5.25,7.05,null,17,1.4]
[34,5.07,5.07,6.67,6.67,null,5.47,7.28,null,18,1.43]
[35,5.28,5.28,6.9,6.9,null,5.69,7.54,null,19,1.46]
[36,5.5,5.5,7.13,7.13,null,5.92,7.79,null,20,1.49]
[37,5.73,5.73,7.37,7.37,null,6.17,8.06,null,21,1.52]
[38,5.96,5.96,7.63,7.63,null,6.42,8.33,null,22,1.55]
[39,6.21,6.21,7.88,7.88,null,6.68,8.61,null,23,1.58]
[40,6.46,6.46,8.16,8.16,null,6.96,8.9,null,24,1.61]
[41,6.73,6.73,8.44,8.44,null,7.24,9.2100000000000009,null,25,1.64]
[42,7.01,7.01,8.7200000000000006,8.7200000000000006,null,7.54,9.52,null,26,1.67]
[43,7.29,7.29,9.02,9.02,null,7.84,9.84,null,27,1.71]
[44,7.59,7.59,9.32,9.32,null,8.16,10.17,null,28,1.74]
[45,7.9,7.9,9.64,9.64,null,8.5,10.52,null,29,1.78]
[46,8.23,8.23,9.9700000000000006,9.9700000000000006,null,8.84,10.87,null,30,1.81]
[47,8.56,8.56,10.3,10.3,null,9.1999999999999993,11.24,null,31,1.85]
[48,8.91,8.91,10.65,10.65,null,9.57,11.62,null,32,1.88]
[49,9.2799999999999994,9.2799999999999994,11.02,11.02,null,9.9600000000000009,12.01,null,33,1.92]
[50,9.66,9.66,11.38,11.38,null,10.37,12.4,null,34,1.96]
[51,10.06,10.06,11.77,11.77,null,10.79,12.82,null,35,2]
[52,10.47,10.47,12.17,12.17,null,11.22,13.25,null,36,2.04]
[53,10.9,10.9,12.59,12.59,null,11.68,13.7,null,37,2.08]
[54,11.35,11.35,13.02,13.02,null,12.15,14.16,null,38,2.12]
[55,11.81,11.81,13.45,13.45,null,12.65,14.64,null,39,2.16]
[56,12.3,12.3,13.92,13.92,null,13.16,15.13,null,40,2.21]
[57,12.82,12.82,14.4,14.4,null,13.7,15.65,null,41,2.25]
[58,13.35,13.35,14.9,14.9,null,14.26,16.18,null,42,2.2999999999999998]
[59,13.91,13.91,15.42,15.42,null,14.85,16.73,null,43,2.34]
[60,14.5,14.5,15.97,15.97,null,15.47,17.309999999999999,null,44,2.39]
[61,15.12,15.12,16.54,16.54,null,16.12,17.920000000000002,null,45,2.44]
[62,15.78,15.78,17.149999999999999,17.149999999999999,null,16.8,18.55,null,46,2.4900000000000002]
[63,16.47,16.47,17.79,17.79,null,17.52,19.22,null,47,2.54]
[64,17.21,17.21,18.45,18.45,null,18.29,19.920000000000002,null,48,2.59]
[65,17.32,17.32,18.48,18.48,null,18.420000000000002,19.97,null,49,2.64]
[66,16.78,16.78,17.850000000000001,17.850000000000001,null,17.88,19.329999999999998,null,50,2.69]
[67,16.239999999999998,16.239999999999998,17.21,17.21,null,17.34,18.690000000000001]
[68,15.69,15.69,16.559999999999999,16.559999999999999,null,16.79,18.04]
[69,15.13,15.13,15.92,15.92,null,16.23,17.399999999999999]
[70,14.58,14.58,15.29,15.29,null,15.67,16.760000000000002]
[71,14.02,14.02,14.66,14.66,null,15.11,16.12]
[72,13.46,13.46,14.04,14.04,null,14.55,15.48]
{"$rows_left_out":68}